File:  [NetBSD Developer Wiki] / wikisrc / pkgsrc / macosx_tiger_powerpc.mdwn
Revision 1.6: download - view: text, annotated - select for diffs
Sun Aug 17 03:12:34 2014 UTC (7 years, 2 months ago) by wiki
Branches: MAIN
CVS tags: HEAD
web commit by https://www.geeklan.co.uk/openid/venture37: lang/ruby21-base dbm.bundle not built

    1: [[!meta title="pkgsrc on Mac OS X 10.4 (Tiger) powerpc"]]
    2: 
    3: [Sevan Janiyan](https://www.twitter.com/sevanjaniyan) and others are finding and fixing pkgsrc problems on
    4: Darwin/powerpc 8.11 (Mac OS X 10.4, a.k.a. "Tiger"), then [building
    5: binary packages](https://www.geeklan.co.uk/?p=1579).
    6: 
    7: ## Interesting problems
    8: 
    9: Bored? Choose one of these problems we need solved. Annoyed? Write
   10: down the problem here.
   11: 
   12: ### lang/perl5
   13: 
   14: Some apparently incorrect default `MACOSX_DEPLOYMENT_TARGET` breaks
   15: the build.
   16: 
   17: ### misc/tmux
   18: [[!template id=filecontent name="misc/tmux" text="""
   19: osdep-darwin.c:22:21: error: libproc.h: No such file or directory
   20: osdep-darwin.c: In function 'osdep_get_name':
   21: osdep-darwin.c:36: error: storage size of 'bsdinfo' isn't known
   22: osdep-darwin.c:43: warning: implicit declaration of function 'proc_pidinfo'
   23: osdep-darwin.c:43: error: 'PROC_PIDTBSDINFO' undeclared (first use in this function)
   24: osdep-darwin.c:43: error: (Each undeclared identifier is reported only once
   25: osdep-darwin.c:43: error: for each function it appears in.)
   26: osdep-darwin.c: In function 'osdep_get_cwd':
   27: osdep-darwin.c:53: error: 'PATH_MAX' undeclared (first use in this function)
   28: osdep-darwin.c:54: error: storage size of 'pathinfo' isn't known
   29: osdep-darwin.c:61: error: 'PROC_PIDVNODEPATHINFO' undeclared (first use in this function)
   30: *** Error code 1
   31: """]]
   32: Macports deals with this issue by [switching osdep-darwin.c out for a previous version](https://svn.macports.org/repository/macports/trunk/dports/sysutils/tmux/files/osdep-darwin.8.c) which compiles under Darwin 8
   33: 
   34: ###devel/cmake
   35: [[!template id=filecontent name="devel/cmake" text="""
   36: Linking CXX executable ../bin/ccmake
   37: /usr/libexec/gcc/powerpc-apple-darwin8/4.0.1/ld: warning can't open dynamic library: /Developer/SDKs/MacOSX10.4u.sdk/usr/pkg/lib/liblzma.5.dylib referenced from: /tmp/devel/cmake/work/.buildlink/lib/libarchive.dylib (checking for undefined symbols may be affected) (No such file or directory, errno = 2)
   38: /usr/libexec/gcc/powerpc-apple-darwin8/4.0.1/ld: warning can't open dynamic library: /Developer/SDKs/MacOSX10.4u.sdk/usr/pkg/lib/libcrypto.1.0.0.dylib referenced from: /tmp/devel/cmake/work/.buildlink/lib/libarchive.dylib (checking for undefined symbols may be affected) (No such file or directory, errno = 2)
   39: /usr/libexec/gcc/powerpc-apple-darwin8/4.0.1/ld: warning can't open dynamic library: /Developer/SDKs/MacOSX10.4u.sdk/usr/pkg/lib/libidn.11.dylib referenced from: /tmp/devel/cmake/work/.buildlink/lib/libcurl.dylib (checking for undefined symbols may be affected) (No such file or directory, errno = 2)
   40: /usr/libexec/gcc/powerpc-apple-darwin8/4.0.1/ld: warning can't open dynamic library: /Developer/SDKs/MacOSX10.4u.sdk/usr/pkg/lib/libintl.8.dylib referenced from: /tmp/devel/cmake/work/.buildlink/lib/libcurl.dylib (checking for undefined symbols may be affected) (No such file or directory, errno = 2)
   41: /usr/libexec/gcc/powerpc-apple-darwin8/4.0.1/ld: warning can't open dynamic library: /Developer/SDKs/MacOSX10.4u.sdk/usr/pkg/lib/libssl.1.0.0.dylib referenced from: /tmp/devel/cmake/work/.buildlink/lib/libcurl.dylib (checking for undefined symbols may be affected) (No such file or directory, errno = 2)
   42: /usr/libexec/gcc/powerpc-apple-darwin8/4.0.1/ld: Undefined symbols:
   43: _lzma_alone_decoder referenced from libarchive expected to be defined in /usr/pkg/lib/liblzma.5.dylib
   44: _lzma_code referenced from libarchive expected to be defined in /usr/pkg/lib/liblzma.5.dylib
   45: _lzma_end referenced from libarchive expected to be defined in /usr/pkg/lib/liblzma.5.dylib
   46: _lzma_stream_decoder referenced from libarchive expected to be defined in /usr/pkg/lib/liblzma.5.dylib
   47: _lzma_alone_encoder referenced from libarchive expected to be defined in /usr/pkg/lib/liblzma.5.dylib
   48: _lzma_lzma_preset referenced from libarchive expected to be defined in /usr/pkg/lib/liblzma.5.dylib
   49: _lzma_memusage referenced from libarchive expected to be defined in /usr/pkg/lib/liblzma.5.dylib
   50: _lzma_stream_encoder referenced from libarchive expected to be defined in /usr/pkg/lib/liblzma.5.dylib
   51: _RIPEMD160_Final referenced from libarchive expected to be defined in /usr/pkg/lib/libcrypto.1.0.0.dylib
   52: _RIPEMD160_Init referenced from libarchive expected to be defined in /usr/pkg/lib/libcrypto.1.0.0.dylib
   53: _RIPEMD160_Update referenced from libarchive expected to be defined in /usr/pkg/lib/libcrypto.1.0.0.dylib
   54: _SHA256_Final referenced from libarchive expected to be defined in /usr/pkg/lib/libcrypto.1.0.0.dylib
   55: _SHA256_Init referenced from libarchive expected to be defined in /usr/pkg/lib/libcrypto.1.0.0.dylib
   56: _SHA256_Update referenced from libarchive expected to be defined in /usr/pkg/lib/libcrypto.1.0.0.dylib
   57: _SHA384_Final referenced from libarchive expected to be defined in /usr/pkg/lib/libcrypto.1.0.0.dylib
   58: _SHA384_Init referenced from libarchive expected to be defined in /usr/pkg/lib/libcrypto.1.0.0.dylib
   59: _SHA384_Update referenced from libarchive expected to be defined in /usr/pkg/lib/libcrypto.1.0.0.dylib
   60: _SHA512_Final referenced from libarchive expected to be defined in /usr/pkg/lib/libcrypto.1.0.0.dylib
   61: _SHA512_Init referenced from libarchive expected to be defined in /usr/pkg/lib/libcrypto.1.0.0.dylib
   62: _SHA512_Update referenced from libarchive expected to be defined in /usr/pkg/lib/libcrypto.1.0.0.dylib
   63: _idn_free referenced from libcurl expected to be defined in /usr/pkg/lib/libidn.11.dylib
   64: _idna_to_ascii_lz referenced from libcurl expected to be defined in /usr/pkg/lib/libidn.11.dylib
   65: _idna_to_unicode_lzlz referenced from libcurl expected to be defined in /usr/pkg/lib/libidn.11.dylib
   66: _stringprep_check_version referenced from libcurl expected to be defined in /usr/pkg/lib/libidn.11.dylib
   67: _stringprep_locale_charset referenced from libcurl expected to be defined in /usr/pkg/lib/libidn.11.dylib
   68: _tld_check_lz referenced from libcurl expected to be defined in /usr/pkg/lib/libidn.11.dylib
   69: _tld_strerror referenced from libcurl expected to be defined in /usr/pkg/lib/libidn.11.dylib
   70: _MD5_Final referenced from libcurl expected to be defined in /usr/pkg/lib/libcrypto.1.0.0.dylib
   71: _MD5_Init referenced from libcurl expected to be defined in /usr/pkg/lib/libcrypto.1.0.0.dylib
   72: _MD5_Update referenced from libcurl expected to be defined in /usr/pkg/lib/libcrypto.1.0.0.dylib
   73: _idna_strerror referenced from libcurl expected to be defined in /usr/pkg/lib/libidn.11.dylib
   74: _DES_ecb_encrypt referenced from libcurl expected to be defined in /usr/pkg/lib/libcrypto.1.0.0.dylib
   75: _DES_set_key referenced from libcurl expected to be defined in /usr/pkg/lib/libcrypto.1.0.0.dylib
   76: _DES_set_odd_parity referenced from libcurl expected to be defined in /usr/pkg/lib/libcrypto.1.0.0.dylib
   77: _MD4_Final referenced from libcurl expected to be defined in /usr/pkg/lib/libcrypto.1.0.0.dylib
   78: _MD4_Init referenced from libcurl expected to be defined in /usr/pkg/lib/libcrypto.1.0.0.dylib
   79: _MD4_Update referenced from libcurl expected to be defined in /usr/pkg/lib/libcrypto.1.0.0.dylib
   80: _ASN1_INTEGER_get referenced from libcurl expected to be defined in /usr/pkg/lib/libcrypto.1.0.0.dylib
   81: _ASN1_STRING_data referenced from libcurl expected to be defined in /usr/pkg/lib/libcrypto.1.0.0.dylib
   82: _ASN1_STRING_length referenced from libcurl expected to be defined in /usr/pkg/lib/libcrypto.1.0.0.dylib
   83: _ASN1_STRING_print referenced from libcurl expected to be defined in /usr/pkg/lib/libcrypto.1.0.0.dylib
   84: _ASN1_STRING_to_UTF8 referenced from libcurl expected to be defined in /usr/pkg/lib/libcrypto.1.0.0.dylib
   85: _ASN1_STRING_type referenced from libcurl expected to be defined in /usr/pkg/lib/libcrypto.1.0.0.dylib
   86: _BIO_ctrl referenced from libcurl expected to be defined in /usr/pkg/lib/libcrypto.1.0.0.dylib
   87: _BIO_free referenced from libcurl expected to be defined in /usr/pkg/lib/libcrypto.1.0.0.dylib
   88: _BIO_new referenced from libcurl expected to be defined in /usr/pkg/lib/libcrypto.1.0.0.dylib
   89: _BIO_s_mem referenced from libcurl expected to be defined in /usr/pkg/lib/libcrypto.1.0.0.dylib
   90: _BN_bn2bin referenced from libcurl expected to be defined in /usr/pkg/lib/libcrypto.1.0.0.dylib
   91: _BN_num_bits referenced from libcurl expected to be defined in /usr/pkg/lib/libcrypto.1.0.0.dylib
   92: _CRYPTO_cleanup_all_ex_data referenced from libcurl expected to be defined in /usr/pkg/lib/libcrypto.1.0.0.dylib
   93: _CRYPTO_free referenced from libcurl expected to be defined in /usr/pkg/lib/libcrypto.1.0.0.dylib
   94: _CRYPTO_malloc referenced from libcurl expected to be defined in /usr/pkg/lib/libcrypto.1.0.0.dylib
   95: _ENGINE_by_id referenced from libcurl expected to be defined in /usr/pkg/lib/libcrypto.1.0.0.dylib
   96: _ENGINE_cleanup referenced from libcurl expected to be defined in /usr/pkg/lib/libcrypto.1.0.0.dylib
   97: _ENGINE_ctrl referenced from libcurl expected to be defined in /usr/pkg/lib/libcrypto.1.0.0.dylib
   98: _ENGINE_ctrl_cmd referenced from libcurl expected to be defined in /usr/pkg/lib/libcrypto.1.0.0.dylib
   99: _ENGINE_finish referenced from libcurl expected to be defined in /usr/pkg/lib/libcrypto.1.0.0.dylib
  100: _ENGINE_free referenced from libcurl expected to be defined in /usr/pkg/lib/libcrypto.1.0.0.dylib
  101: _ENGINE_get_first referenced from libcurl expected to be defined in /usr/pkg/lib/libcrypto.1.0.0.dylib
  102: _ENGINE_get_id referenced from libcurl expected to be defined in /usr/pkg/lib/libcrypto.1.0.0.dylib
  103: _ENGINE_get_next referenced from libcurl expected to be defined in /usr/pkg/lib/libcrypto.1.0.0.dylib
  104: _ENGINE_init referenced from libcurl expected to be defined in /usr/pkg/lib/libcrypto.1.0.0.dylib
  105: _ENGINE_load_builtin_engines referenced from libcurl expected to be defined in /usr/pkg/lib/libcrypto.1.0.0.dylib
  106: _ENGINE_load_private_key referenced from libcurl expected to be defined in /usr/pkg/lib/libcrypto.1.0.0.dylib
  107: _ENGINE_set_default referenced from libcurl expected to be defined in /usr/pkg/lib/libcrypto.1.0.0.dylib
  108: _ERR_clear_error referenced from libcurl expected to be defined in /usr/pkg/lib/libcrypto.1.0.0.dylib
  109: _ERR_error_string referenced from libcurl expected to be defined in /usr/pkg/lib/libcrypto.1.0.0.dylib
  110: _ERR_error_string_n referenced from libcurl expected to be defined in /usr/pkg/lib/libcrypto.1.0.0.dylib
  111: _ERR_free_strings referenced from libcurl expected to be defined in /usr/pkg/lib/libcrypto.1.0.0.dylib
  112: _ERR_get_error referenced from libcurl expected to be defined in /usr/pkg/lib/libcrypto.1.0.0.dylib
  113: _ERR_peek_error referenced from libcurl expected to be defined in /usr/pkg/lib/libcrypto.1.0.0.dylib
  114: _ERR_remove_thread_state referenced from libcurl expected to be defined in /usr/pkg/lib/libcrypto.1.0.0.dylib
  115: _EVP_PKEY_copy_parameters referenced from libcurl expected to be defined in /usr/pkg/lib/libcrypto.1.0.0.dylib
  116: _EVP_PKEY_free referenced from libcurl expected to be defined in /usr/pkg/lib/libcrypto.1.0.0.dylib
  117: _EVP_cleanup referenced from libcurl expected to be defined in /usr/pkg/lib/libcrypto.1.0.0.dylib
  118: _GENERAL_NAMES_free referenced from libcurl expected to be defined in /usr/pkg/lib/libcrypto.1.0.0.dylib
  119: _OPENSSL_add_all_algorithms_noconf referenced from libcurl expected to be defined in /usr/pkg/lib/libcrypto.1.0.0.dylib
  120: _OPENSSL_config referenced from libcurl expected to be defined in /usr/pkg/lib/libcrypto.1.0.0.dylib
  121: _PEM_read_X509 referenced from libcurl expected to be defined in /usr/pkg/lib/libcrypto.1.0.0.dylib
  122: _PEM_write_bio_X509 referenced from libcurl expected to be defined in /usr/pkg/lib/libcrypto.1.0.0.dylib
  123: _PKCS12_PBE_add referenced from libcurl expected to be defined in /usr/pkg/lib/libcrypto.1.0.0.dylib
  124: _PKCS12_free referenced from libcurl expected to be defined in /usr/pkg/lib/libcrypto.1.0.0.dylib
  125: _PKCS12_parse referenced from libcurl expected to be defined in /usr/pkg/lib/libcrypto.1.0.0.dylib
  126: _RAND_add referenced from libcurl expected to be defined in /usr/pkg/lib/libcrypto.1.0.0.dylib
  127: _RAND_bytes referenced from libcurl expected to be defined in /usr/pkg/lib/libcrypto.1.0.0.dylib
  128: _RAND_egd referenced from libcurl expected to be defined in /usr/pkg/lib/libcrypto.1.0.0.dylib
  129: _RAND_file_name referenced from libcurl expected to be defined in /usr/pkg/lib/libcrypto.1.0.0.dylib
  130: _RAND_load_file referenced from libcurl expected to be defined in /usr/pkg/lib/libcrypto.1.0.0.dylib
  131: _RAND_status referenced from libcurl expected to be defined in /usr/pkg/lib/libcrypto.1.0.0.dylib
  132: _SSL_CIPHER_get_name referenced from libcurl expected to be defined in /usr/pkg/lib/libssl.1.0.0.dylib
  133: _SSL_CTX_add_client_CA referenced from libcurl expected to be defined in /usr/pkg/lib/libssl.1.0.0.dylib
  134: _SSL_CTX_callback_ctrl referenced from libcurl expected to be defined in /usr/pkg/lib/libssl.1.0.0.dylib
  135: _SSL_CTX_check_private_key referenced from libcurl expected to be defined in /usr/pkg/lib/libssl.1.0.0.dylib
  136: _SSL_CTX_ctrl referenced from libcurl expected to be defined in /usr/pkg/lib/libssl.1.0.0.dylib
  137: _SSL_CTX_free referenced from libcurl expected to be defined in /usr/pkg/lib/libssl.1.0.0.dylib
  138: _SSL_CTX_get_cert_store referenced from libcurl expected to be defined in /usr/pkg/lib/libssl.1.0.0.dylib
  139: _SSL_CTX_load_verify_locations referenced from libcurl expected to be defined in /usr/pkg/lib/libssl.1.0.0.dylib
  140: _SSL_CTX_new referenced from libcurl expected to be defined in /usr/pkg/lib/libssl.1.0.0.dylib
  141: _SSL_CTX_set_cipher_list referenced from libcurl expected to be defined in /usr/pkg/lib/libssl.1.0.0.dylib
  142: _SSL_CTX_set_default_passwd_cb referenced from libcurl expected to be defined in /usr/pkg/lib/libssl.1.0.0.dylib
  143: _SSL_CTX_set_default_passwd_cb_userdata referenced from libcurl expected to be defined in /usr/pkg/lib/libssl.1.0.0.dylib
  144: _SSL_CTX_set_srp_password referenced from libcurl expected to be defined in /usr/pkg/lib/libssl.1.0.0.dylib
  145: _SSL_CTX_set_srp_username referenced from libcurl expected to be defined in /usr/pkg/lib/libssl.1.0.0.dylib
  146: _SSL_CTX_set_verify referenced from libcurl expected to be defined in /usr/pkg/lib/libssl.1.0.0.dylib
  147: _SSL_CTX_use_PrivateKey referenced from libcurl expected to be defined in /usr/pkg/lib/libssl.1.0.0.dylib
  148: _SSL_CTX_use_PrivateKey_file referenced from libcurl expected to be defined in /usr/pkg/lib/libssl.1.0.0.dylib
  149: _SSL_CTX_use_certificate referenced from libcurl expected to be defined in /usr/pkg/lib/libssl.1.0.0.dylib
  150: _SSL_CTX_use_certificate_chain_file referenced from libcurl expected to be defined in /usr/pkg/lib/libssl.1.0.0.dylib
  151: _SSL_CTX_use_certificate_file referenced from libcurl expected to be defined in /usr/pkg/lib/libssl.1.0.0.dylib
  152: _SSL_SESSION_free referenced from libcurl expected to be defined in /usr/pkg/lib/libssl.1.0.0.dylib
  153: _SSL_connect referenced from libcurl expected to be defined in /usr/pkg/lib/libssl.1.0.0.dylib
  154: _SSL_ctrl referenced from libcurl expected to be defined in /usr/pkg/lib/libssl.1.0.0.dylib
  155: _SSL_free referenced from libcurl expected to be defined in /usr/pkg/lib/libssl.1.0.0.dylib
  156: _SSL_get1_session referenced from libcurl expected to be defined in /usr/pkg/lib/libssl.1.0.0.dylib
  157: _SSL_get_certificate referenced from libcurl expected to be defined in /usr/pkg/lib/libssl.1.0.0.dylib
  158: _SSL_get_current_cipher referenced from libcurl expected to be defined in /usr/pkg/lib/libssl.1.0.0.dylib
  159: _SSL_get_error referenced from libcurl expected to be defined in /usr/pkg/lib/libssl.1.0.0.dylib
  160: _SSL_get_peer_cert_chain referenced from libcurl expected to be defined in /usr/pkg/lib/libssl.1.0.0.dylib
  161: _SSL_get_peer_certificate referenced from libcurl expected to be defined in /usr/pkg/lib/libssl.1.0.0.dylib
  162: _SSL_get_privatekey referenced from libcurl expected to be defined in /usr/pkg/lib/libssl.1.0.0.dylib
  163: _SSL_get_session referenced from libcurl expected to be defined in /usr/pkg/lib/libssl.1.0.0.dylib
  164: _SSL_get_shutdown referenced from libcurl expected to be defined in /usr/pkg/lib/libssl.1.0.0.dylib
  165: _SSL_get_verify_result referenced from libcurl expected to be defined in /usr/pkg/lib/libssl.1.0.0.dylib
  166: _SSL_library_init referenced from libcurl expected to be defined in /usr/pkg/lib/libssl.1.0.0.dylib
  167: _SSL_load_error_strings referenced from libcurl expected to be defined in /usr/pkg/lib/libssl.1.0.0.dylib
  168: _SSL_new referenced from libcurl expected to be defined in /usr/pkg/lib/libssl.1.0.0.dylib
  169: _SSL_peek referenced from libcurl expected to be defined in /usr/pkg/lib/libssl.1.0.0.dylib
  170: _SSL_pending referenced from libcurl expected to be defined in /usr/pkg/lib/libssl.1.0.0.dylib
  171: _SSL_read referenced from libcurl expected to be defined in /usr/pkg/lib/libssl.1.0.0.dylib
  172: _SSL_set_connect_state referenced from libcurl expected to be defined in /usr/pkg/lib/libssl.1.0.0.dylib
  173: _SSL_set_fd referenced from libcurl expected to be defined in /usr/pkg/lib/libssl.1.0.0.dylib
  174: _SSL_set_session referenced from libcurl expected to be defined in /usr/pkg/lib/libssl.1.0.0.dylib
  175: _SSL_shutdown referenced from libcurl expected to be defined in /usr/pkg/lib/libssl.1.0.0.dylib
  176: _SSL_write referenced from libcurl expected to be defined in /usr/pkg/lib/libssl.1.0.0.dylib
  177: _SSLeay referenced from libcurl expected to be defined in /usr/pkg/lib/libcrypto.1.0.0.dylib
  178: _SSLv23_client_method referenced from libcurl expected to be defined in /usr/pkg/lib/libssl.1.0.0.dylib
  179: _SSLv2_client_method referenced from libcurl expected to be defined in /usr/pkg/lib/libssl.1.0.0.dylib
  180: _SSLv3_client_method referenced from libcurl expected to be defined in /usr/pkg/lib/libssl.1.0.0.dylib
  181: _UI_OpenSSL referenced from libcurl expected to be defined in /usr/pkg/lib/libcrypto.1.0.0.dylib
  182: _UI_create_method referenced from libcurl expected to be defined in /usr/pkg/lib/libcrypto.1.0.0.dylib
  183: _UI_destroy_method referenced from libcurl expected to be defined in /usr/pkg/lib/libcrypto.1.0.0.dylib
  184: _UI_get0_user_data referenced from libcurl expected to be defined in /usr/pkg/lib/libcrypto.1.0.0.dylib
  185: _UI_get_input_flags referenced from libcurl expected to be defined in /usr/pkg/lib/libcrypto.1.0.0.dylib
  186: _UI_get_string_type referenced from libcurl expected to be defined in /usr/pkg/lib/libcrypto.1.0.0.dylib
  187: _UI_method_get_closer referenced from libcurl expected to be defined in /usr/pkg/lib/libcrypto.1.0.0.dylib
  188: _UI_method_get_opener referenced from libcurl expected to be defined in /usr/pkg/lib/libcrypto.1.0.0.dylib
  189: _UI_method_get_reader referenced from libcurl expected to be defined in /usr/pkg/lib/libcrypto.1.0.0.dylib
  190: _UI_method_get_writer referenced from libcurl expected to be defined in /usr/pkg/lib/libcrypto.1.0.0.dylib
  191: _UI_method_set_closer referenced from libcurl expected to be defined in /usr/pkg/lib/libcrypto.1.0.0.dylib
  192: _UI_method_set_opener referenced from libcurl expected to be defined in /usr/pkg/lib/libcrypto.1.0.0.dylib
  193: _UI_method_set_reader referenced from libcurl expected to be defined in /usr/pkg/lib/libcrypto.1.0.0.dylib
  194: _UI_method_set_writer referenced from libcurl expected to be defined in /usr/pkg/lib/libcrypto.1.0.0.dylib
  195: _UI_set_result referenced from libcurl expected to be defined in /usr/pkg/lib/libcrypto.1.0.0.dylib
  196: _X509V3_EXT_print referenced from libcurl expected to be defined in /usr/pkg/lib/libcrypto.1.0.0.dylib
  197: _X509_EXTENSION_get_critical referenced from libcurl expected to be defined in /usr/pkg/lib/libcrypto.1.0.0.dylib
  198: _X509_EXTENSION_get_object referenced from libcurl expected to be defined in /usr/pkg/lib/libcrypto.1.0.0.dylib
  199: _X509_LOOKUP_file referenced from libcurl expected to be defined in /usr/pkg/lib/libcrypto.1.0.0.dylib
  200: _X509_NAME_ENTRY_get_data referenced from libcurl expected to be defined in /usr/pkg/lib/libcrypto.1.0.0.dylib
  201: _X509_NAME_get_entry referenced from libcurl expected to be defined in /usr/pkg/lib/libcrypto.1.0.0.dylib
  202: _X509_NAME_get_index_by_NID referenced from libcurl expected to be defined in /usr/pkg/lib/libcrypto.1.0.0.dylib
  203: _X509_NAME_print_ex referenced from libcurl expected to be defined in /usr/pkg/lib/libcrypto.1.0.0.dylib
  204: _X509_STORE_CTX_get_current_cert referenced from libcurl expected to be defined in /usr/pkg/lib/libcrypto.1.0.0.dylib
  205: _X509_STORE_add_lookup referenced from libcurl expected to be defined in /usr/pkg/lib/libcrypto.1.0.0.dylib
  206: _X509_STORE_set_flags referenced from libcurl expected to be defined in /usr/pkg/lib/libcrypto.1.0.0.dylib
  207: _X509_check_issued referenced from libcurl expected to be defined in /usr/pkg/lib/libcrypto.1.0.0.dylib
  208: _X509_free referenced from libcurl expected to be defined in /usr/pkg/lib/libcrypto.1.0.0.dylib
  209: _X509_get_ext_d2i referenced from libcurl expected to be defined in /usr/pkg/lib/libcrypto.1.0.0.dylib
  210: _X509_get_issuer_name referenced from libcurl expected to be defined in /usr/pkg/lib/libcrypto.1.0.0.dylib
  211: _X509_get_pubkey referenced from libcurl expected to be defined in /usr/pkg/lib/libcrypto.1.0.0.dylib
  212: _X509_get_serialNumber referenced from libcurl expected to be defined in /usr/pkg/lib/libcrypto.1.0.0.dylib
  213: _X509_get_subject_name referenced from libcurl expected to be defined in /usr/pkg/lib/libcrypto.1.0.0.dylib
  214: _X509_load_crl_file referenced from libcurl expected to be defined in /usr/pkg/lib/libcrypto.1.0.0.dylib
  215: _X509_verify_cert_error_string referenced from libcurl expected to be defined in /usr/pkg/lib/libcrypto.1.0.0.dylib
  216: _d2i_PKCS12_fp referenced from libcurl expected to be defined in /usr/pkg/lib/libcrypto.1.0.0.dylib
  217: _i2t_ASN1_OBJECT referenced from libcurl expected to be defined in /usr/pkg/lib/libcrypto.1.0.0.dylib
  218: _sk_num referenced from libcurl expected to be defined in /usr/pkg/lib/libcrypto.1.0.0.dylib
  219: _sk_pop referenced from libcurl expected to be defined in /usr/pkg/lib/libcrypto.1.0.0.dylib
  220: _sk_pop_free referenced from libcurl expected to be defined in /usr/pkg/lib/libcrypto.1.0.0.dylib
  221: _sk_value referenced from libcurl expected to be defined in /usr/pkg/lib/libcrypto.1.0.0.dylib
  222: collect2: ld returned 1 exit status
  223: Source/CMakeFiles/ccmake.dir/build.make:395: recipe for target 'bin/ccmake' failed
  224: gmake[2]: *** [bin/ccmake] Error 1
  225: CMakeFiles/Makefile2:1525: recipe for target 'Source/CMakeFiles/ccmake.dir/all' failed
  226: gmake[1]: *** [Source/CMakeFiles/ccmake.dir/all] Error 2
  227: Makefile:147: recipe for target 'all' failed
  228: gmake: *** [all] Error 2
  229: """]]
  230: 
  231: 
  232: ### lang/ruby21-base
  233: [[!template id=filecontent name="lang/ruby21-base install.log" text="""
  234: Failed to configure dbm. It will not be installed.
  235: => Automatic manual page handling
  236: => Generating post-install file lists
  237: pkg_create: can't stat `/tmp/lang/ruby21-base/work/.destdir/usr/pkg/lib/ruby/2.1.2/powerpc-darwin8/dbm.bundle'
  238: => Checking file-check results for ruby212-base-2.1.2
  239: ERROR: ************************************************************
  240: ERROR: The following files are in the PLIST but not in /tmp/lang/ruby21-base/work/.destdir/usr/pkg:
  241: ERROR:         /tmp/lang/ruby21-base/work/.destdir/usr/pkg/lib/ruby/2.1.2/powerpc-darwin8/dbm.bundle
  242: *** Error code 
  243: """]]

CVSweb for NetBSD wikisrc <wikimaster@NetBSD.org> software: FreeBSD-CVSweb