Diff for /wikisrc/pkgsrc/macosx_tiger_powerpc.mdwn between versions 1.4 and 1.9

version 1.4, 2014/08/15 18:55:57 version 1.9, 2014/08/17 18:19:45
Line 4 Line 4
 Darwin/powerpc 8.11 (Mac OS X 10.4, a.k.a. "Tiger"), then [building  Darwin/powerpc 8.11 (Mac OS X 10.4, a.k.a. "Tiger"), then [building
 binary packages](https://www.geeklan.co.uk/?p=1579).  binary packages](https://www.geeklan.co.uk/?p=1579).
   
   ## Nice to have
   Not specific to tiger, but better integration with OS X as a whole
   
   * Encourage the use of `path_helper(8)` to append `PATH` & `MANPATH` on Leopard & newer
   * Bundle `launchd.plist` for binaries which can be daemonised, inspired from the Joyent effort to bundle `SMF`
   * The means to generate a Mac OS X bootstrap package is deprecated, while it's still currently possible to use tools for older releases to generate a package, the native method for Mavericks & newer needs to be integrated
   
 ## Interesting problems  ## Interesting problems
   
 Bored? Choose one of these problems we need solved. Annoyed? Write  Bored? Choose one of these problems we need solved. Annoyed? Write
 down the problem here.  down the problem here.
   
 ### lang/perl5  ### [[!toggle id="perl5" text="lang/perl5"]]
   [[!toggleable id="perl5" text="""
 Some apparently incorrect default `MACOSX_DEPLOYMENT_TARGET` breaks  Some apparently incorrect default `MACOSX_DEPLOYMENT_TARGET` breaks
 the build.  the build.
   """]]
   
 ### misc/tmux  ### [[!toggle id="tmux" text="misc/tmux"]]
 [[!template id=filecontent name="misc/tmux" text="""  [[!toggleable id="tmux" text="""
   [[!template id=filecontent name="misc/tmux" text=<<TMUXINNER
 osdep-darwin.c:22:21: error: libproc.h: No such file or directory  osdep-darwin.c:22:21: error: libproc.h: No such file or directory
 osdep-darwin.c: In function 'osdep_get_name':  osdep-darwin.c: In function 'osdep_get_name':
 osdep-darwin.c:36: error: storage size of 'bsdinfo' isn't known  osdep-darwin.c:36: error: storage size of 'bsdinfo' isn't known
Line 28  osdep-darwin.c:53: error: 'PATH_MAX' und Line 37  osdep-darwin.c:53: error: 'PATH_MAX' und
 osdep-darwin.c:54: error: storage size of 'pathinfo' isn't known  osdep-darwin.c:54: error: storage size of 'pathinfo' isn't known
 osdep-darwin.c:61: error: 'PROC_PIDVNODEPATHINFO' undeclared (first use in this function)  osdep-darwin.c:61: error: 'PROC_PIDVNODEPATHINFO' undeclared (first use in this function)
 *** Error code 1  *** Error code 1
 """]]  TMUXINNER]]
 Macports deals with this issue by [switching osdep-darwin.c out for a previous version](https://svn.macports.org/repository/macports/trunk/dports/sysutils/tmux/files/osdep-darwin.8.c) which compiles under Darwin 8  Macports deals with this issue by [switching osdep-darwin.c out for a previous version](https://svn.macports.org/repository/macports/trunk/dports/sysutils/tmux/files/osdep-darwin.8.c) which compiles under Darwin 8
   """]]
   
   ### [[!toggle id="cmake" text="devel/cmake"]]
   [[!toggleable id="cmake" text="""
   [[!template id=filecontent name="devel/cmake" text=<<CMAKEINNER
   Linking CXX executable ../bin/ccmake
   /usr/libexec/gcc/powerpc-apple-darwin8/4.0.1/ld: warning can't open dynamic library: /Developer/SDKs/MacOSX10.4u.sdk/usr/pkg/lib/liblzma.5.dylib referenced from: /tmp/devel/cmake/work/.buildlink/lib/libarchive.dylib (checking for undefined symbols may be affected) (No such file or directory, errno = 2)
   /usr/libexec/gcc/powerpc-apple-darwin8/4.0.1/ld: warning can't open dynamic library: /Developer/SDKs/MacOSX10.4u.sdk/usr/pkg/lib/libcrypto.1.0.0.dylib referenced from: /tmp/devel/cmake/work/.buildlink/lib/libarchive.dylib (checking for undefined symbols may be affected) (No such file or directory, errno = 2)
   /usr/libexec/gcc/powerpc-apple-darwin8/4.0.1/ld: warning can't open dynamic library: /Developer/SDKs/MacOSX10.4u.sdk/usr/pkg/lib/libidn.11.dylib referenced from: /tmp/devel/cmake/work/.buildlink/lib/libcurl.dylib (checking for undefined symbols may be affected) (No such file or directory, errno = 2)
   /usr/libexec/gcc/powerpc-apple-darwin8/4.0.1/ld: warning can't open dynamic library: /Developer/SDKs/MacOSX10.4u.sdk/usr/pkg/lib/libintl.8.dylib referenced from: /tmp/devel/cmake/work/.buildlink/lib/libcurl.dylib (checking for undefined symbols may be affected) (No such file or directory, errno = 2)
   /usr/libexec/gcc/powerpc-apple-darwin8/4.0.1/ld: warning can't open dynamic library: /Developer/SDKs/MacOSX10.4u.sdk/usr/pkg/lib/libssl.1.0.0.dylib referenced from: /tmp/devel/cmake/work/.buildlink/lib/libcurl.dylib (checking for undefined symbols may be affected) (No such file or directory, errno = 2)
   /usr/libexec/gcc/powerpc-apple-darwin8/4.0.1/ld: Undefined symbols:
   _lzma_alone_decoder referenced from libarchive expected to be defined in /usr/pkg/lib/liblzma.5.dylib
   _lzma_code referenced from libarchive expected to be defined in /usr/pkg/lib/liblzma.5.dylib
   _lzma_end referenced from libarchive expected to be defined in /usr/pkg/lib/liblzma.5.dylib
   _lzma_stream_decoder referenced from libarchive expected to be defined in /usr/pkg/lib/liblzma.5.dylib
   _lzma_alone_encoder referenced from libarchive expected to be defined in /usr/pkg/lib/liblzma.5.dylib
   _lzma_lzma_preset referenced from libarchive expected to be defined in /usr/pkg/lib/liblzma.5.dylib
   _lzma_memusage referenced from libarchive expected to be defined in /usr/pkg/lib/liblzma.5.dylib
   _lzma_stream_encoder referenced from libarchive expected to be defined in /usr/pkg/lib/liblzma.5.dylib
   _RIPEMD160_Final referenced from libarchive expected to be defined in /usr/pkg/lib/libcrypto.1.0.0.dylib
   _RIPEMD160_Init referenced from libarchive expected to be defined in /usr/pkg/lib/libcrypto.1.0.0.dylib
   _RIPEMD160_Update referenced from libarchive expected to be defined in /usr/pkg/lib/libcrypto.1.0.0.dylib
   _SHA256_Final referenced from libarchive expected to be defined in /usr/pkg/lib/libcrypto.1.0.0.dylib
   _SHA256_Init referenced from libarchive expected to be defined in /usr/pkg/lib/libcrypto.1.0.0.dylib
   _SHA256_Update referenced from libarchive expected to be defined in /usr/pkg/lib/libcrypto.1.0.0.dylib
   _SHA384_Final referenced from libarchive expected to be defined in /usr/pkg/lib/libcrypto.1.0.0.dylib
   _SHA384_Init referenced from libarchive expected to be defined in /usr/pkg/lib/libcrypto.1.0.0.dylib
   _SHA384_Update referenced from libarchive expected to be defined in /usr/pkg/lib/libcrypto.1.0.0.dylib
   _SHA512_Final referenced from libarchive expected to be defined in /usr/pkg/lib/libcrypto.1.0.0.dylib
   _SHA512_Init referenced from libarchive expected to be defined in /usr/pkg/lib/libcrypto.1.0.0.dylib
   _SHA512_Update referenced from libarchive expected to be defined in /usr/pkg/lib/libcrypto.1.0.0.dylib
   _idn_free referenced from libcurl expected to be defined in /usr/pkg/lib/libidn.11.dylib
   _idna_to_ascii_lz referenced from libcurl expected to be defined in /usr/pkg/lib/libidn.11.dylib
   _idna_to_unicode_lzlz referenced from libcurl expected to be defined in /usr/pkg/lib/libidn.11.dylib
   _stringprep_check_version referenced from libcurl expected to be defined in /usr/pkg/lib/libidn.11.dylib
   _stringprep_locale_charset referenced from libcurl expected to be defined in /usr/pkg/lib/libidn.11.dylib
   _tld_check_lz referenced from libcurl expected to be defined in /usr/pkg/lib/libidn.11.dylib
   _tld_strerror referenced from libcurl expected to be defined in /usr/pkg/lib/libidn.11.dylib
   _MD5_Final referenced from libcurl expected to be defined in /usr/pkg/lib/libcrypto.1.0.0.dylib
   _MD5_Init referenced from libcurl expected to be defined in /usr/pkg/lib/libcrypto.1.0.0.dylib
   _MD5_Update referenced from libcurl expected to be defined in /usr/pkg/lib/libcrypto.1.0.0.dylib
   _idna_strerror referenced from libcurl expected to be defined in /usr/pkg/lib/libidn.11.dylib
   _DES_ecb_encrypt referenced from libcurl expected to be defined in /usr/pkg/lib/libcrypto.1.0.0.dylib
   _DES_set_key referenced from libcurl expected to be defined in /usr/pkg/lib/libcrypto.1.0.0.dylib
   _DES_set_odd_parity referenced from libcurl expected to be defined in /usr/pkg/lib/libcrypto.1.0.0.dylib
   _MD4_Final referenced from libcurl expected to be defined in /usr/pkg/lib/libcrypto.1.0.0.dylib
   _MD4_Init referenced from libcurl expected to be defined in /usr/pkg/lib/libcrypto.1.0.0.dylib
   _MD4_Update referenced from libcurl expected to be defined in /usr/pkg/lib/libcrypto.1.0.0.dylib
   _ASN1_INTEGER_get referenced from libcurl expected to be defined in /usr/pkg/lib/libcrypto.1.0.0.dylib
   _ASN1_STRING_data referenced from libcurl expected to be defined in /usr/pkg/lib/libcrypto.1.0.0.dylib
   _ASN1_STRING_length referenced from libcurl expected to be defined in /usr/pkg/lib/libcrypto.1.0.0.dylib
   _ASN1_STRING_print referenced from libcurl expected to be defined in /usr/pkg/lib/libcrypto.1.0.0.dylib
   _ASN1_STRING_to_UTF8 referenced from libcurl expected to be defined in /usr/pkg/lib/libcrypto.1.0.0.dylib
   _ASN1_STRING_type referenced from libcurl expected to be defined in /usr/pkg/lib/libcrypto.1.0.0.dylib
   _BIO_ctrl referenced from libcurl expected to be defined in /usr/pkg/lib/libcrypto.1.0.0.dylib
   _BIO_free referenced from libcurl expected to be defined in /usr/pkg/lib/libcrypto.1.0.0.dylib
   _BIO_new referenced from libcurl expected to be defined in /usr/pkg/lib/libcrypto.1.0.0.dylib
   _BIO_s_mem referenced from libcurl expected to be defined in /usr/pkg/lib/libcrypto.1.0.0.dylib
   _BN_bn2bin referenced from libcurl expected to be defined in /usr/pkg/lib/libcrypto.1.0.0.dylib
   _BN_num_bits referenced from libcurl expected to be defined in /usr/pkg/lib/libcrypto.1.0.0.dylib
   _CRYPTO_cleanup_all_ex_data referenced from libcurl expected to be defined in /usr/pkg/lib/libcrypto.1.0.0.dylib
   _CRYPTO_free referenced from libcurl expected to be defined in /usr/pkg/lib/libcrypto.1.0.0.dylib
   _CRYPTO_malloc referenced from libcurl expected to be defined in /usr/pkg/lib/libcrypto.1.0.0.dylib
   _ENGINE_by_id referenced from libcurl expected to be defined in /usr/pkg/lib/libcrypto.1.0.0.dylib
   _ENGINE_cleanup referenced from libcurl expected to be defined in /usr/pkg/lib/libcrypto.1.0.0.dylib
   _ENGINE_ctrl referenced from libcurl expected to be defined in /usr/pkg/lib/libcrypto.1.0.0.dylib
   _ENGINE_ctrl_cmd referenced from libcurl expected to be defined in /usr/pkg/lib/libcrypto.1.0.0.dylib
   _ENGINE_finish referenced from libcurl expected to be defined in /usr/pkg/lib/libcrypto.1.0.0.dylib
   _ENGINE_free referenced from libcurl expected to be defined in /usr/pkg/lib/libcrypto.1.0.0.dylib
   _ENGINE_get_first referenced from libcurl expected to be defined in /usr/pkg/lib/libcrypto.1.0.0.dylib
   _ENGINE_get_id referenced from libcurl expected to be defined in /usr/pkg/lib/libcrypto.1.0.0.dylib
   _ENGINE_get_next referenced from libcurl expected to be defined in /usr/pkg/lib/libcrypto.1.0.0.dylib
   _ENGINE_init referenced from libcurl expected to be defined in /usr/pkg/lib/libcrypto.1.0.0.dylib
   _ENGINE_load_builtin_engines referenced from libcurl expected to be defined in /usr/pkg/lib/libcrypto.1.0.0.dylib
   _ENGINE_load_private_key referenced from libcurl expected to be defined in /usr/pkg/lib/libcrypto.1.0.0.dylib
   _ENGINE_set_default referenced from libcurl expected to be defined in /usr/pkg/lib/libcrypto.1.0.0.dylib
   _ERR_clear_error referenced from libcurl expected to be defined in /usr/pkg/lib/libcrypto.1.0.0.dylib
   _ERR_error_string referenced from libcurl expected to be defined in /usr/pkg/lib/libcrypto.1.0.0.dylib
   _ERR_error_string_n referenced from libcurl expected to be defined in /usr/pkg/lib/libcrypto.1.0.0.dylib
   _ERR_free_strings referenced from libcurl expected to be defined in /usr/pkg/lib/libcrypto.1.0.0.dylib
   _ERR_get_error referenced from libcurl expected to be defined in /usr/pkg/lib/libcrypto.1.0.0.dylib
   _ERR_peek_error referenced from libcurl expected to be defined in /usr/pkg/lib/libcrypto.1.0.0.dylib
   _ERR_remove_thread_state referenced from libcurl expected to be defined in /usr/pkg/lib/libcrypto.1.0.0.dylib
   _EVP_PKEY_copy_parameters referenced from libcurl expected to be defined in /usr/pkg/lib/libcrypto.1.0.0.dylib
   _EVP_PKEY_free referenced from libcurl expected to be defined in /usr/pkg/lib/libcrypto.1.0.0.dylib
   _EVP_cleanup referenced from libcurl expected to be defined in /usr/pkg/lib/libcrypto.1.0.0.dylib
   _GENERAL_NAMES_free referenced from libcurl expected to be defined in /usr/pkg/lib/libcrypto.1.0.0.dylib
   _OPENSSL_add_all_algorithms_noconf referenced from libcurl expected to be defined in /usr/pkg/lib/libcrypto.1.0.0.dylib
   _OPENSSL_config referenced from libcurl expected to be defined in /usr/pkg/lib/libcrypto.1.0.0.dylib
   _PEM_read_X509 referenced from libcurl expected to be defined in /usr/pkg/lib/libcrypto.1.0.0.dylib
   _PEM_write_bio_X509 referenced from libcurl expected to be defined in /usr/pkg/lib/libcrypto.1.0.0.dylib
   _PKCS12_PBE_add referenced from libcurl expected to be defined in /usr/pkg/lib/libcrypto.1.0.0.dylib
   _PKCS12_free referenced from libcurl expected to be defined in /usr/pkg/lib/libcrypto.1.0.0.dylib
   _PKCS12_parse referenced from libcurl expected to be defined in /usr/pkg/lib/libcrypto.1.0.0.dylib
   _RAND_add referenced from libcurl expected to be defined in /usr/pkg/lib/libcrypto.1.0.0.dylib
   _RAND_bytes referenced from libcurl expected to be defined in /usr/pkg/lib/libcrypto.1.0.0.dylib
   _RAND_egd referenced from libcurl expected to be defined in /usr/pkg/lib/libcrypto.1.0.0.dylib
   _RAND_file_name referenced from libcurl expected to be defined in /usr/pkg/lib/libcrypto.1.0.0.dylib
   _RAND_load_file referenced from libcurl expected to be defined in /usr/pkg/lib/libcrypto.1.0.0.dylib
   _RAND_status referenced from libcurl expected to be defined in /usr/pkg/lib/libcrypto.1.0.0.dylib
   _SSL_CIPHER_get_name referenced from libcurl expected to be defined in /usr/pkg/lib/libssl.1.0.0.dylib
   _SSL_CTX_add_client_CA referenced from libcurl expected to be defined in /usr/pkg/lib/libssl.1.0.0.dylib
   _SSL_CTX_callback_ctrl referenced from libcurl expected to be defined in /usr/pkg/lib/libssl.1.0.0.dylib
   _SSL_CTX_check_private_key referenced from libcurl expected to be defined in /usr/pkg/lib/libssl.1.0.0.dylib
   _SSL_CTX_ctrl referenced from libcurl expected to be defined in /usr/pkg/lib/libssl.1.0.0.dylib
   _SSL_CTX_free referenced from libcurl expected to be defined in /usr/pkg/lib/libssl.1.0.0.dylib
   _SSL_CTX_get_cert_store referenced from libcurl expected to be defined in /usr/pkg/lib/libssl.1.0.0.dylib
   _SSL_CTX_load_verify_locations referenced from libcurl expected to be defined in /usr/pkg/lib/libssl.1.0.0.dylib
   _SSL_CTX_new referenced from libcurl expected to be defined in /usr/pkg/lib/libssl.1.0.0.dylib
   _SSL_CTX_set_cipher_list referenced from libcurl expected to be defined in /usr/pkg/lib/libssl.1.0.0.dylib
   _SSL_CTX_set_default_passwd_cb referenced from libcurl expected to be defined in /usr/pkg/lib/libssl.1.0.0.dylib
   _SSL_CTX_set_default_passwd_cb_userdata referenced from libcurl expected to be defined in /usr/pkg/lib/libssl.1.0.0.dylib
   _SSL_CTX_set_srp_password referenced from libcurl expected to be defined in /usr/pkg/lib/libssl.1.0.0.dylib
   _SSL_CTX_set_srp_username referenced from libcurl expected to be defined in /usr/pkg/lib/libssl.1.0.0.dylib
   _SSL_CTX_set_verify referenced from libcurl expected to be defined in /usr/pkg/lib/libssl.1.0.0.dylib
   _SSL_CTX_use_PrivateKey referenced from libcurl expected to be defined in /usr/pkg/lib/libssl.1.0.0.dylib
   _SSL_CTX_use_PrivateKey_file referenced from libcurl expected to be defined in /usr/pkg/lib/libssl.1.0.0.dylib
   _SSL_CTX_use_certificate referenced from libcurl expected to be defined in /usr/pkg/lib/libssl.1.0.0.dylib
   _SSL_CTX_use_certificate_chain_file referenced from libcurl expected to be defined in /usr/pkg/lib/libssl.1.0.0.dylib
   _SSL_CTX_use_certificate_file referenced from libcurl expected to be defined in /usr/pkg/lib/libssl.1.0.0.dylib
   _SSL_SESSION_free referenced from libcurl expected to be defined in /usr/pkg/lib/libssl.1.0.0.dylib
   _SSL_connect referenced from libcurl expected to be defined in /usr/pkg/lib/libssl.1.0.0.dylib
   _SSL_ctrl referenced from libcurl expected to be defined in /usr/pkg/lib/libssl.1.0.0.dylib
   _SSL_free referenced from libcurl expected to be defined in /usr/pkg/lib/libssl.1.0.0.dylib
   _SSL_get1_session referenced from libcurl expected to be defined in /usr/pkg/lib/libssl.1.0.0.dylib
   _SSL_get_certificate referenced from libcurl expected to be defined in /usr/pkg/lib/libssl.1.0.0.dylib
   _SSL_get_current_cipher referenced from libcurl expected to be defined in /usr/pkg/lib/libssl.1.0.0.dylib
   _SSL_get_error referenced from libcurl expected to be defined in /usr/pkg/lib/libssl.1.0.0.dylib
   _SSL_get_peer_cert_chain referenced from libcurl expected to be defined in /usr/pkg/lib/libssl.1.0.0.dylib
   _SSL_get_peer_certificate referenced from libcurl expected to be defined in /usr/pkg/lib/libssl.1.0.0.dylib
   _SSL_get_privatekey referenced from libcurl expected to be defined in /usr/pkg/lib/libssl.1.0.0.dylib
   _SSL_get_session referenced from libcurl expected to be defined in /usr/pkg/lib/libssl.1.0.0.dylib
   _SSL_get_shutdown referenced from libcurl expected to be defined in /usr/pkg/lib/libssl.1.0.0.dylib
   _SSL_get_verify_result referenced from libcurl expected to be defined in /usr/pkg/lib/libssl.1.0.0.dylib
   _SSL_library_init referenced from libcurl expected to be defined in /usr/pkg/lib/libssl.1.0.0.dylib
   _SSL_load_error_strings referenced from libcurl expected to be defined in /usr/pkg/lib/libssl.1.0.0.dylib
   _SSL_new referenced from libcurl expected to be defined in /usr/pkg/lib/libssl.1.0.0.dylib
   _SSL_peek referenced from libcurl expected to be defined in /usr/pkg/lib/libssl.1.0.0.dylib
   _SSL_pending referenced from libcurl expected to be defined in /usr/pkg/lib/libssl.1.0.0.dylib
   _SSL_read referenced from libcurl expected to be defined in /usr/pkg/lib/libssl.1.0.0.dylib
   _SSL_set_connect_state referenced from libcurl expected to be defined in /usr/pkg/lib/libssl.1.0.0.dylib
   _SSL_set_fd referenced from libcurl expected to be defined in /usr/pkg/lib/libssl.1.0.0.dylib
   _SSL_set_session referenced from libcurl expected to be defined in /usr/pkg/lib/libssl.1.0.0.dylib
   _SSL_shutdown referenced from libcurl expected to be defined in /usr/pkg/lib/libssl.1.0.0.dylib
   _SSL_write referenced from libcurl expected to be defined in /usr/pkg/lib/libssl.1.0.0.dylib
   _SSLeay referenced from libcurl expected to be defined in /usr/pkg/lib/libcrypto.1.0.0.dylib
   _SSLv23_client_method referenced from libcurl expected to be defined in /usr/pkg/lib/libssl.1.0.0.dylib
   _SSLv2_client_method referenced from libcurl expected to be defined in /usr/pkg/lib/libssl.1.0.0.dylib
   _SSLv3_client_method referenced from libcurl expected to be defined in /usr/pkg/lib/libssl.1.0.0.dylib
   _UI_OpenSSL referenced from libcurl expected to be defined in /usr/pkg/lib/libcrypto.1.0.0.dylib
   _UI_create_method referenced from libcurl expected to be defined in /usr/pkg/lib/libcrypto.1.0.0.dylib
   _UI_destroy_method referenced from libcurl expected to be defined in /usr/pkg/lib/libcrypto.1.0.0.dylib
   _UI_get0_user_data referenced from libcurl expected to be defined in /usr/pkg/lib/libcrypto.1.0.0.dylib
   _UI_get_input_flags referenced from libcurl expected to be defined in /usr/pkg/lib/libcrypto.1.0.0.dylib
   _UI_get_string_type referenced from libcurl expected to be defined in /usr/pkg/lib/libcrypto.1.0.0.dylib
   _UI_method_get_closer referenced from libcurl expected to be defined in /usr/pkg/lib/libcrypto.1.0.0.dylib
   _UI_method_get_opener referenced from libcurl expected to be defined in /usr/pkg/lib/libcrypto.1.0.0.dylib
   _UI_method_get_reader referenced from libcurl expected to be defined in /usr/pkg/lib/libcrypto.1.0.0.dylib
   _UI_method_get_writer referenced from libcurl expected to be defined in /usr/pkg/lib/libcrypto.1.0.0.dylib
   _UI_method_set_closer referenced from libcurl expected to be defined in /usr/pkg/lib/libcrypto.1.0.0.dylib
   _UI_method_set_opener referenced from libcurl expected to be defined in /usr/pkg/lib/libcrypto.1.0.0.dylib
   _UI_method_set_reader referenced from libcurl expected to be defined in /usr/pkg/lib/libcrypto.1.0.0.dylib
   _UI_method_set_writer referenced from libcurl expected to be defined in /usr/pkg/lib/libcrypto.1.0.0.dylib
   _UI_set_result referenced from libcurl expected to be defined in /usr/pkg/lib/libcrypto.1.0.0.dylib
   _X509V3_EXT_print referenced from libcurl expected to be defined in /usr/pkg/lib/libcrypto.1.0.0.dylib
   _X509_EXTENSION_get_critical referenced from libcurl expected to be defined in /usr/pkg/lib/libcrypto.1.0.0.dylib
   _X509_EXTENSION_get_object referenced from libcurl expected to be defined in /usr/pkg/lib/libcrypto.1.0.0.dylib
   _X509_LOOKUP_file referenced from libcurl expected to be defined in /usr/pkg/lib/libcrypto.1.0.0.dylib
   _X509_NAME_ENTRY_get_data referenced from libcurl expected to be defined in /usr/pkg/lib/libcrypto.1.0.0.dylib
   _X509_NAME_get_entry referenced from libcurl expected to be defined in /usr/pkg/lib/libcrypto.1.0.0.dylib
   _X509_NAME_get_index_by_NID referenced from libcurl expected to be defined in /usr/pkg/lib/libcrypto.1.0.0.dylib
   _X509_NAME_print_ex referenced from libcurl expected to be defined in /usr/pkg/lib/libcrypto.1.0.0.dylib
   _X509_STORE_CTX_get_current_cert referenced from libcurl expected to be defined in /usr/pkg/lib/libcrypto.1.0.0.dylib
   _X509_STORE_add_lookup referenced from libcurl expected to be defined in /usr/pkg/lib/libcrypto.1.0.0.dylib
   _X509_STORE_set_flags referenced from libcurl expected to be defined in /usr/pkg/lib/libcrypto.1.0.0.dylib
   _X509_check_issued referenced from libcurl expected to be defined in /usr/pkg/lib/libcrypto.1.0.0.dylib
   _X509_free referenced from libcurl expected to be defined in /usr/pkg/lib/libcrypto.1.0.0.dylib
   _X509_get_ext_d2i referenced from libcurl expected to be defined in /usr/pkg/lib/libcrypto.1.0.0.dylib
   _X509_get_issuer_name referenced from libcurl expected to be defined in /usr/pkg/lib/libcrypto.1.0.0.dylib
   _X509_get_pubkey referenced from libcurl expected to be defined in /usr/pkg/lib/libcrypto.1.0.0.dylib
   _X509_get_serialNumber referenced from libcurl expected to be defined in /usr/pkg/lib/libcrypto.1.0.0.dylib
   _X509_get_subject_name referenced from libcurl expected to be defined in /usr/pkg/lib/libcrypto.1.0.0.dylib
   _X509_load_crl_file referenced from libcurl expected to be defined in /usr/pkg/lib/libcrypto.1.0.0.dylib
   _X509_verify_cert_error_string referenced from libcurl expected to be defined in /usr/pkg/lib/libcrypto.1.0.0.dylib
   _d2i_PKCS12_fp referenced from libcurl expected to be defined in /usr/pkg/lib/libcrypto.1.0.0.dylib
   _i2t_ASN1_OBJECT referenced from libcurl expected to be defined in /usr/pkg/lib/libcrypto.1.0.0.dylib
   _sk_num referenced from libcurl expected to be defined in /usr/pkg/lib/libcrypto.1.0.0.dylib
   _sk_pop referenced from libcurl expected to be defined in /usr/pkg/lib/libcrypto.1.0.0.dylib
   _sk_pop_free referenced from libcurl expected to be defined in /usr/pkg/lib/libcrypto.1.0.0.dylib
   _sk_value referenced from libcurl expected to be defined in /usr/pkg/lib/libcrypto.1.0.0.dylib
   collect2: ld returned 1 exit status
   Source/CMakeFiles/ccmake.dir/build.make:395: recipe for target 'bin/ccmake' failed
   gmake[2]: *** [bin/ccmake] Error 1
   CMakeFiles/Makefile2:1525: recipe for target 'Source/CMakeFiles/ccmake.dir/all' failed
   gmake[1]: *** [Source/CMakeFiles/ccmake.dir/all] Error 2
   Makefile:147: recipe for target 'all' failed
   gmake: *** [all] Error 2
   CMAKEINNER]]
   """]]
   
   
   ### [[!toggle id="ruby21-base" text="lang/ruby21-base"]]
   [[!toggleable id="ruby21-base" text="""
   [[!template id=filecontent name="lang/ruby21-base install.log" text=<<RUBY21BASEINNER
   Failed to configure dbm. It will not be installed.
   => Automatic manual page handling
   => Generating post-install file lists
   pkg_create: can't stat `/tmp/lang/ruby21-base/work/.destdir/usr/pkg/lib/ruby/2.1.2/powerpc-darwin8/dbm.bundle'
   => Checking file-check results for ruby212-base-2.1.2
   ERROR: ************************************************************
   ERROR: The following files are in the PLIST but not in /tmp/lang/ruby21-base/work/.destdir/usr/pkg:
   ERROR:         /tmp/lang/ruby21-base/work/.destdir/usr/pkg/lib/ruby/2.1.2/powerpc-darwin8/dbm.bundle
   *** Error code 
   RUBY21BASEINNER]]
   """]]
   
   ### [[!toggle id="MesaLib" text="graphics/MesaLib"]]
   [[!toggleable id="MesaLib" text="""
   [[!template id=filecontent name="graphics/MesaLib install.log" text=<<MESALIBINNER
   => Automatic manual page handling
   => Generating post-install file lists
   => Checking file-check results for MesaLib-7.11.2nb5
   ERROR: ************************************************************
   ERROR: The following files are in /tmp/graphics/MesaLib/work/.destdir/usr/pkg but not in the PLIST:
   ERROR:         /tmp/graphics/MesaLib/work/.destdir/usr/pkg/lib/libGL.dylib
   ERROR:         /tmp/graphics/MesaLib/work/.destdir/usr/pkg/lib/libOSMesa.dylib
   *** Error code 1
   
   Index: PLIST
   ===================================================================
   RCS file: /cvsroot/pkgsrc/graphics/MesaLib/PLIST,v
   retrieving revision 1.26
   diff -u -r1.26 PLIST
   --- PLIST       20 May 2013 06:59:18 -0000      1.26
   +++ PLIST       17 Aug 2014 03:16:09 -0000
   @@ -16,12 +16,14 @@
    include/GL/vms_x_fix.h
    include/GL/wglext.h
    include/GL/wmesa.h
   +lib/libGL.dylib
    lib/libGL.so
    lib/libGL.so.1
    lib/libGL.so.1.2
    lib/libGLw.so
    lib/libGLw.so.1
    lib/libGLw.so.1.0.0
   +lib/libOSMesa.dylib
    ${PLIST.nodri}lib/libOSMesa.so
    ${PLIST.nodri}lib/libOSMesa.so.7
    ${PLIST.nodri}lib/libOSMesa.so.7.11.0
   MESALIBINNER]]
   """]]

Removed from v.1.4  
changed lines
  Added in v.1.9


CVSweb for NetBSD wikisrc <wikimaster@NetBSD.org> software: FreeBSD-CVSweb